Johann Arensburg
type: Concept
type: person
definition: Münzmeister in Zerbst von 1666 bis 1668 und in Rottleberode von 1668 bis 1669.Münzmeister in Zerbst von 1669 bis 1670 und in Wernigerode von 1671 bis 1674.Münzwardein in Halberstadt von 1674 bis 1675 und Münzmeister in Halberstadt von 1675 bis 1677.Arensburg arbeitete auch für Regenstein von 1674 bis 1677.
gender: male
forename: Johann
surname: Arensburg
date of birth: 1630
date of death: 1699
date of birth and death: 1630-1699
function or role: Münzmeister (MM Nz)
function or role: Münzwardein
in scheme: person
created: 2026-07-01
creator: mk berlin

Münzmeister (MM Nz)
preferred label: Mintmaster (MM Mod) @en

Münzwardein
preferred label: Warden @en