Pastorino
type: Concept
type: person
definition: Argentinischer Medailleur, belegt um 1910.
gender: male
surname: Pastorino
function or role: Medailleur/in
in scheme: person
created: 2026-07-06
creator: mk berlin

Medailleur/in
preferred label: Medalist @en