James Taylor
type: Concept
type: person
definition: Britischer Medailleur, belegt in den 1840er Jahren in Birmingham.
gender: male
forename: James
surname: Taylor
function or role: Medailleur/in
in scheme: person
created: 2026-07-13
modified: 2026-07-13
creator: mk berlin

Medailleur/in
preferred label: Medalist @en