Antonio Maria de Gennaro
type: Concept
type: person
definition: Italienisch-österreichischer Hofmedailleur und Direktor der königlich-kaiserlichen Graveurakademie in Wien.
gender: male
forename: Antonio Maria de
surname: Gennaro
date of birth: 1679
date of death: 1744
date of birth and death: 1679-03.10.1744
function or role: Medailleur/in
in scheme: person
created: 2026-07-13
creator: mk berlin

Medailleur/in
preferred label: Medalist @en