Carlo Moscetti
type: Concept
type: person
definition: Italienischer Medailleur in Rom, belegt 1869 bis 1886.Lit.: L. Forrer, Biographiocal Dictionary of Medallists IV (1909) 161.
gender: male
forename: Carlo
surname: Moscetti
function or role: Medailleur/in
in scheme: person
created: 2026-07-13
modified: 2026-07-13
creator: mk berlin

Medailleur/in
preferred label: Medalist @en