James Pradier
type: Concept
type: person
definition: Französischer Bildhauer und Medailleur.Lit.: L. Forrer, Biographical Dictionary of Medallist IV (1909) 682.
gender: male
forename: James
surname: Pradier
date of birth: 1790
date of death: 1852
date of birth and death: 23.05.1790 - 04.06.1852
function or role: Medailleur/in
in scheme: person
created: 2026-07-13
creator: mk berlin

Medailleur/in
preferred label: Medalist @en