Leopoldo de Almeida
type: Concept
type: person
definition: Portugiesischer Bildhauer und Medailleur.
gender: male
forename: Leopoldo de
surname: Almeida
date of birth: 1898
date of death: 1975
date of birth and death: 18.10.1898 - 28.04.1975
function or role: Medailleur/in
in scheme: person
created: 2026-07-13
modified: 2026-07-13
creator: mk berlin

Medailleur/in
preferred label: Medalist @en