M.-F.-Joseph Thomas
type: Concept
type: person
definition: Münzmeister in Nantes von 1782 bis 1794.Sein persönliches Zeichen ist ein sitzender Hund.
gender: male
forename: M.-F.-Joseph
surname: Thomas
function or role: Münzmeister (MM Nz)
in scheme: person
created: 2026-07-13
creator: mk berlin

Münzmeister (MM Nz)
preferred label: Mintmaster (MM Mod) @en