Johann Thomas Stettner
type: Concept
type: person
definition: Stempelschneider (Marken) und Medailleur in Nürnberg.Lit.: M. H. Grieb, (Hrsg.), Nürnberger Künstlerlexikon (2007) 1490.
gender: male
forename: Johann Thomas
surname: Stettner
date of birth: 1785
date of death: 1872
date of birth and death: 1785-27.07.1872
function or role: Medailleur/in
function or role: Stempelschneider
in scheme: person
created: 2026-07-13
creator: mk berlin

Medailleur/in
preferred label: Medalist @en

Stempelschneider
preferred label: Die-cutter @en