Johann Jakob Lauer
type: Concept
type: person
definition: Rechenpfennigmacher, Stempelschneider (Marken) und Medailleur in Nürnberg.
gender: male
forename: Johann Jakob
surname: Lauer
date of birth: 1789
date of death: 1865
date of birth and death: 1789-1865
function or role: Medailleur/in
function or role: Stempelschneider
function or role: Rechenpfg.-macher
in scheme: person
created: 2026-07-14
creator: mk berlin

Medailleur/in
preferred label: Medalist @en

Stempelschneider
preferred label: Die-cutter @en