Johann Lorenz Natter
type: Concept
type: person
definition: Deutscher Steinschneider und Medailleur.
gender: male
forename: Johann Lorenz
surname: Natter
date of birth: 1705
date of death: 1763
date of birth and death: 21.03.1705 - 27.10.1763
function or role: Medailleur/in
in scheme: person
created: 2026-07-16
creator: mk berlin

Medailleur/in
preferred label: Medalist @en