Dr. Paul Lazarus
type: Concept
type: person
definition: Deutscher Rabbiner.Emigrierte 1939.Geschenk an das Münzkabinett Berlin im Jahre 1927.
gender: male
prefix: Dr.
forename: Paul
surname: Lazarus
date of birth: 1888
date of death: 1951
date of birth and death: 30.10.1888 - 01.01.1951
function or role: Vorbesitzer
function or role: Dargestellte/r
in scheme: person
created: 2026-07-17
modified: 2026-07-17
creator: mk berlin

Vorbesitzer
preferred label: previous Owner @en

Dargestellte/r
preferred label: Sitter @en