Emilie Melchior, geborene Frankenstein
type: Concept
type: person
preferred label: Emilie Melchior, née Frankenstein @en
definition: Ihr Bildnis erscheint auf einer Plakette von Karl Dautert um 1927.
gender: female
forename: Emilie
surname: Melchior, geborene Frankenstein
surname: Melchior, née Frankenstein @en
date of birth: 1856
date of death: 1943
date of birth and death: 1856-1943
function or role: Dargestellte/r
in scheme: person
created: 2026-07-17
modified: 2026-07-17
creator: mk berlin

Dargestellte/r
preferred label: Sitter @en