Reinhold Melchior
type: Concept
type: person
definition: Herr Reinhold Melchior, W 30, Heilbronnerstr. 19.Geschenk an das Münzkabinett Berlin im Jahre 1928.
gender: male
forename: Reinhold
surname: Melchior
function or role: Vorbesitzer
in scheme: person
created: 2026-07-17
modified: 2026-07-17
creator: mk berlin

Vorbesitzer
preferred label: previous Owner @en