Johann Jakob Encke
type: Concept
type: person
definition: Münzmeister in Hanau von 1741 bis 1771.Münzmeister (Amtsverwalter) in Frankfurt am Main von 1760 bis 1761.
gender: male
forename: Johann Jakob
surname: Encke
date of birth: 1693
date of death: 1771
date of birth and death: 1693-1771
function or role: Münzmeister (MM Nz)
in scheme: person
created: 2026-07-27
creator: mk berlin

Münzmeister (MM Nz)
preferred label: Mintmaster (MM Mod) @en