Rudolf Nendel
type: Concept
type: person
definition: Der Name Nendel erscheint auf Notgeldscheinen der Paradiesbettenfabrik Steiner Frankenberg aus dem Jahr 1923.
gender: male
forename: Rudolf
surname: Nendel
function or role: Eigentümer (Unterzeichner)
in scheme: person
created: 2024-05-10
modified: 2024-05-10

Eigentümer (Unterzeichner)
preferred label: Owner (Signatory) @en