S. Schleusener
type: Concept
type: person
definition: Der Name S. Schleusener erscheint auf Notgeldscheinen der Stadt Brandenburg an der Havel aus dem Jahr 1918.
gender: male
forename: S.
surname: Schleusener
function or role: Bevollmächtigter
in scheme: person
created: 2024-05-10
modified: 2024-05-10

Bevollmächtigter
preferred label: Mandatory @en