Christian Friedrich Krell
type: Concept
type: person
definition: Stempelschneider, tätig von 1776 bis 1802.
gender: male
forename: Christian Friedrich
surname: Krell
function or role: Stempelschneider
in scheme: person
created: 2026-04-09
creator: mk berlin

Stempelschneider
preferred label: Die-cutter @en