Antoine Brucher
type: Concept
type: person
definition: Französischer Medailleur und Stempelschneider (Marken und Münzen) in Paris von 1558 bis 1568.Lit.: L. Forrer, Bibliographical Dictionary of Medallists I (1904) 298 f.
gender: male
forename: Antoine
surname: Brucher
function or role: Medailleur/in
function or role: Stempelschneider
in scheme: person
created: 2026-07-14
creator: mk berlin

Medailleur/in
preferred label: Medalist @en

Stempelschneider
preferred label: Die-cutter @en