Wouter Muller
type: Concept
type: person
definition: Niederländischer Medailleur, belegt zwischen 1653 und 1688.
gender: male
forename: Wouter
surname: Muller
function or role: Medailleur/in
in scheme: person
created: 2026-04-09
modified: 2026-04-09
creator: mk berlin

Medailleur/in
preferred label: Medalist @en