Marcus Aquinus
type: Concept
type: person
definition: Legatus unter C. Cassius Longinus 43-42 v. Chr. RRC Nr. 498 und 499.Lit.: T. R. S. Broughton, The Magistrates of the Roman Republic II (1952) 364.
gender: male
surname: Marcus Aquinus
function or role: Legatus
in scheme: person
created: 2024-05-10
modified: 2024-12-16
creator: mk berlin