Thomas Thomas
type: Concept
type: person
definition: Thomas Thomas, Esquire.Münzsammler.Mehrere Versteigerungen durch Sotheby's nach seinem Tode im Jahre 1843: 23. Februar, 8. Juli, 27. Juli, 29. Juli 1844.Catalogue of the first portion of the very extensive and truly valuable collection of coins and medals, formed during the last fifty years by the late Thomas Thomas, Esq, embracing his very choice cabinet of the English series (sale: 23 February 1844 [9 days]).Catalogue of the first portion of Greek, Roman, and foreign medieval coins and medals, collected during the last fifty years by the late Thomas Thomas, Esq (sale: 8 July 1844 [12 days]).Catalogue of the second portion of Greek, Roman, and foreign medieval coins and medals... sale: 29 July 1844 [13 days].
gender: male
forename: Thomas
surname: Thomas
date of death: 1843
date of birth and death: -1843
function or role: Vorbesitzer
function or role: Dargestellte/r
in scheme: person
created: 2024-05-10
modified: 2024-05-10

Vorbesitzer
preferred label: previous Owner @en

Dargestellte/r
preferred label: Sitter @en