George Frederick Nott
type: Concept
type: person
definition: Reverend George Frederick Nott, D. D., Fellow of All Souls College Oxford und Canon of Winchester.Sammlung auktioniert bei Sotheby's 30.-31. Mai und 1.-4., 6.-8. Juni 1842.Eingang in den Bestand des Münzkabinetts über den Erwerb der Sammlung 1873 Charles Richard Fox.Lit.: H. E. Manville - T. J. Robertson, British Numismatic Auction Catalogues 1710-1984 (1986) 83.
gender: male
forename: George Frederick
surname: Nott
date of birth: 1767
date of death: 1841
date of birth and death: 1767-25.10.1841
function or role: Vorbesitzer
in scheme: person
created: 2024-05-10
modified: 2025-02-07
creator: mk berlin

Vorbesitzer
preferred label: previous Owner @en