Nikokles (ca. 321-306 v. Chr.), König von Paphos
type: Concept
type: person
preferred label: Nikokles (c. 321-306 BC), king of Paphus @en
definition: Belegt durch Münzen im Typus Alexanders des Großen zwischen 325 und 317 v. Chr.Lit.: M. J. Price, The Coinage in the Name of Alexander the Great and Philip Arrhidaeus (1991) Nr. 3118.
gender: male
surname: Nikokles (ca. 321-306 v. Chr.), König von Paphos
surname: Nikokles (c. 321-306 BC), king of Paphus @en
date of death: -306
date of birth and death: -306 v. Chr.
function or role: Münzherr
in scheme: person
created: 2024-05-10
modified: 2024-05-10

Münzherr
preferred label: Authority @en