Robert II. de Lénoncourt (1535-1561), Bischof und Erzbischof
type: Concept
type: person
preferred label: Robert II de Lénoncourt (1535-1561), bishop and archbishop @en
definition: Von 1535 bis 1550 Bischof von Châlons, von 1551 bis 1555 von Metz, von 1555 bis 1560 von Auxerre.Erzbischof von Embrun von 1556 bis 1560, von Arles und Toulouse in den Jahren 1560 und 1561.
gender: male
surname: Robert II. de Lénoncourt (1535-1561), Bischof und Erzbischof
surname: Robert II de Lénoncourt (1535-1561), bishop and archbishop @en
date of birth: 1485
date of death: 1561
date of birth and death: um 1485-04.02.1561
function or role: Dargestellte/r
function or role: Münzherr
in scheme: person
created: 2024-05-10
modified: 2024-05-10

Dargestellte/r
preferred label: Sitter @en

Münzherr
preferred label: Authority @en