Aiantides
type: Concept
type: person
definition: Dritter Magistrat in Athen im Jahre 133/132 v. Chr.Lit.: M. Thompson, The New Style Silver Coinage of Athens (1961) Nr. 376-377 / issue 32; P. M. Fraser - E. Matthews, A Lexicon of Greek Personal Names II Attica (1994) 13 s. v. Aiantides, Nr. 1; H. B. Mattingly, Numismatic Chronicle 157, 1997, 258; W. Leschhorn, Lexikon der Aufschriften auf griechischen Münzen II (2009) 292 s. v. Aiantides.
gender: male
surname: Aiantides
function or role: Magistrat (Ant)
in scheme: person
created: 2024-05-10
modified: 2024-05-10

Magistrat (Ant)
preferred label: Magistrate (Ant) @en